Accelerator Error Codes (and remedial actions)

Note: This article is deprecated. For up-to-date error message documentation, see the ElectricAccelerator Error Messages Guide at http://docs.electric-cloud.com/accelerator_doc/AcceleratorIndex.html.

EMake Error Messages
* EC1001 The 'exclusive' priority is deprecated.  Using 'high' instead.
* EC1002 The command line option \--emake-annotate is deprecated.
* EC1003 Ignoring redundant EMAKE_ROOT value.
* EC1004 Could not create temp dir.
* EC1005 No writable temporary directories are available.
* EC1006 Bad value for \--emake-cygwin.
* EC1007 Unknown annotation detail token.
* EC1008 Invalid logcapture setting. (OBSOLETE)
* EC1009 Unknown pragma.
* EC1010 Unknown history mode.
* EC1011 Invalid compression thresholds.
* EC1012 Invalid write limit: must be 1 or greater.
* EC1013 Unknown make emulation mode option.
* EC1014 \--emake-debugger not supported for cluster builds.
* EC1015 Invalid emake root directory.
* EC1016 Bad root  (e.g. cannot handle UNC path names).
* EC1017 Bad root "/": the root directory is not a supported emake root.
* EC1018 Unable to load cygwin1.dll.
* EC1019 Unable to open annotation output file.
* EC1020 Local mode only supports 'basic' annotation detail.
* EC1021 Local mode does not support setting an annotation file name.
* EC1022 Illegal registry path: root must be one of: HKEY_CLASSES_ROOT or HKEY_LOCAL_MACHINE.
* EC1023 Illegal build mode, switching to 'local'.
* EC1024 Invalid EMAKE_ROOT directory.
* EC1025 Unknown make emulation mode in emulation table.
* EC1026 Cannot open equivalence map: [file] (OBSOLETE)
* EC1027 Invalid file in equivalent map: [error] (OBSOLETE)
* EC1028 Build is stopping.
* EC1029 Unable to determine name of command file.
* EC1030 Unable to open command file.
* EC1031 Unable to write command file.
* EC1032 An exception occurred.
* EC1033 Unable to create temporary file.
* EC1034 The last 60 agent requests to the cluster manager have failed.
* EC1035 Couldn't remove backing store.
* EC1036 Chain::getVersion detected a malformed chain, treating as a stale version.
* EC1037 Cannot open history file.
* EC1038 Version mismatch, ignoring history file.
* EC1039 Ignoring malformed history file: no Section header.
* EC1040 Ignoring malformed history file: a bad Job section header.
* EC1041 Ignoring malformed history file: no Job section.
* EC1042 Ignoring malformed history file: no Serial Deps section.
* EC1043 Ignoring malformed history file: a bad Serial Deps section.
* EC1044 Ignoring malformed history file: no Dependencies.
* EC1045 Ignoring malformed history file: no Prereq Dependencies.
* EC1047 more output fragments than expected.
* EC1048 No agents available; aborting build.
* EC1049 unexpected exception halting build.
* EC1050 agent error; aborting build.
* EC1051 Unable to create link.
* EC1052 Unable to rename directory.
* EC1053 Unable to read input stream.
* EC1054 Unable to determine current working directory.
* EC1055 unexpected exception halting build.
* EC1056 Unable to read directory.
* EC1057 Unable to read ACL for directory.
* EC1058 Unable to read backing store file.
* EC1059 Unable to read backing store file.
* EC1060 Unable to open file.
* EC1061 Unable to modify the file times.
* EC1062 Unable to modify attributes of file.
* EC1063 Unable to create directory.
* EC1064 Unable to modify the file times of file.
* EC1065 Unable to modify attributes of file.
* EC1066 RegQueryInfoKey failed.
* EC1067 RegEnumValue failed.
* EC1068 Unable to open file.
* EC1069 Unable to write file.
* EC1070 Unable to create symlink.
* EC1071 Unable to modify file times of file.
* EC1072 Unable to modify attributes of file.
* EC1073 Job caused multiple agents to fail.
* EC1074 Mismatched object sizes.
* EC1075 No agents enabled on this cluster.  You may want to contact your administrator.
* EC1076 No agents available, waiting...
* EC1077 [n] agent(s) allocated, proceeding...
* EC1078 ios_base::failure.
* EC1080 ios_base::failure.
* EC1082 Agent sent invalid content id.
* EC1083 Agent asked for file data on a non-file.
* EC1084 Agent sent invalid directory id.
* EC1085 Agent attempted to read a stale directory.
* EC1086 Agent attempted to read a stale directory.
* EC1087 Recursive make scheduled by wrong type of job.
* EC1088 Agent sent invalid name id.
* EC1089 Invalid new name id.
* EC1090 Attempted to create a file over an existing file.
* EC1091 Non-negative new name id.
* EC1092 Unable to determine path for [name] (OBSOLETE)
* EC1093 Unable to determine path for [name] (OBSOLETE)
* EC1094 Unable to determine path for [name] (OBSOLETE)
* EC1095 Unable to find current working directory on agent.
* EC1096 Detected invalid job type while reloading parse data.
* EC1097 Detected invalid target type while reloading parse data.
* EC1099 Could not determine temp path on the node.
* EC1100 Command was not A2E_AC, got [hex].
* EC1101 Bad agent request code: [hex].
* EC1102 Node not responding.
* EC1103 Command was not A2E_PUT_VERSION, got [hex].
* EC1104 Received A2E_PARSE_RESULT on wrong type of job.
* EC1105 Command was not A2E_PUT_TEMPDIR, got [hex].
* EC1106 Bad temp dir.
* EC1107 Command was not A2E_ACK, got [hex].
* EC1108 The protocol version of Electric Make ([ver]) is incompatible with the software installed on the Electric Cloud cluster [machine] ([version]).
* EC1109 The protocol version of Electric Make ([ver] is a more recent version than the software installed on the Electric Cloud cluster [machine] ([version]).
* EC1110 The protocol version of Electric Make ([ver]) is incompatible with the software installed on the Electric Cloud cluster [machine] ([version]).
* EC1111 The protocol version of Electric Make ([ver] is a more recent version than the software installed on the Electric Cloud cluster [machine] ([version]).
* EC1112 The protocol version of Electric Make ([ver]) is incompatible with the software installed on the Electric Cloud cluster [machine] ([version]).
* EC1113 The protocol version of Electric Make ([ver] is a more recent version than the software installed on the Electric Cloud cluster [machine] ([version]).
* EC1114 Emake-agent handshake failed, possibly from timeout.
* EC1115 Emake-agent handshake failed (part 2), possibly from timeout.
* EC1116 User terminated build via debugger.
* EC1117 Directory::findContentForDot couldn't find parent for directory.
* EC1118 pipeline error.
* EC1119 pipeline error.
* EC1120 The command line option --emake-multi-remake is deprecated.
* EC1121 The command line option --emake-logcapture is deprecated.
* EC1122 Unable to determine path for [name] (OBSOLETE)
* EC1123 You did not preload cygwin1.dll in your top-level make.  Use \--emake-cygwin=P there.
* EC1124 Unable to rename file [path] to [path].
* EC1125 Unable to convert [option] "[path]":  [error].
* EC1126 error from TCPsocket.
* EC1127 Error growing backing store:  [error].
* EC1128 History file path references non-existent or.
* EC1129 History file is not writable.
* EC1130 Build has fewer roots than history file: [history filename].
* EC1131 Cygwin path translation of "%s" failed.
* EC1132 Remote parse failed.
* EC1133 Invalid ledger option '...' in option string '...'.
* EC1134 Couldn't open ledger file '...'.
* EC1135 Couldn't commit ledger file '...'.
* EC1136 Error accessing Ledger database in parent make.
* EC1137 Unrecognized option "[option]" in EMAKEFLAGS.
* EC1138 Couldn't load ClearCase.
* EC1139 Error accessing ClearCase object.
* EC1140 Invalid cross make OS "[os]".
* EC1141 The priority 'high' is not supported.
* EC1142 Can't create Ant context directory.
* EC1143 Can't remove Ant context directory.
* EC1144 Job XXX modified registry, now reverted.
* EC1145 Empty value specified for --emake-reg-roots.
* EC1146 Agent sent invalid registry key id.
* EC1147 Agent sent invalid registry value id.
* EC1148 Error retrieving subkey information for key NNN.
* EC1149 Error retrieving value information for key NNN.
* EC1150 Unable to invoke emake from stub.
* EC1151 ParseJob XXX failed after N attempts.
* EC1152 Unable to read 'path' for transfer to agent.
* EC1153 Job recorded USAGE_EXISTS on a non-existent file.

* EC1154 Error moving Ledger file to backup location 
* EC1166 [signal]
* EC1170 Fatal Security Error: ...
* EC1171 [agent]: [agentPrincipal]: Security Error: ...
* EC1172 Unknown security mode for agent communications: "[option]"
* EC1173 ...
* EC1174 Invalid ClearCase options [invalid value]
* EC1175 Bad warning number: "[warning]"
* EC1176 Unable to delete temporary file: "[pathname]": [system error]

* EC1177 electrifymon message
* EC1178 Couldn't stat local agent file for copy into backing store
* EC1179 Couldn't open local agent file for copy into backing store
* EC1180 Couldn't get license information
* EC1181 License does not permit...
* EC1182 Failed to raise signal [sig]; instead exiting with code [code]
* EC1183 <makefile>:<line>: WARNING EC1183: #pragma multi is redundant on patterns.
* EC1184 <makefile>:<line>: ERROR EC1184: #pragma multi not supported on patterns that immediately follow non-pattern targets. Stop.
* EC1185 <makefile>:<line>: ERROR EC1185: #pragma multi not supported on static patterns. Stop.
* EC1186 <makefile>:<line>: ERROR EC1186: #pragma multi not supported on double-colon rules. Stop.
* EC1187 <makefile>:<line>: ERROR EC1187: target file `XYZ' has both #pragma multi rules and rules not affected by #pragma multi. Other rule at <makefile>:<line>. Stop.
* EC1188 <makefile>:<line>: ERROR EC1188: target file `XYZ' cannot appear in #pragma multi rules with differing target sets.
Other rule at <makefile>:<line>. Target `ABC' appears only in ... rule. Stop.
* EC1189 <makefile>:<line>: ERROR EC1189: target file `XYZ' involves both #pragma multi and overridden commands.
Other rule at <makefile>:<line>. Stop.
* EC1190 <makefile>:<line>: ERROR EC1190: target file `XYZ' is #pragma multi but has no explicit commands. Stop.
* EC1193 Probable future cache miss: ...
* EC1194 Operation caching error: ...
* EC1195 Parse avoidance ignored path pattern contains internal %: ...
* EC1196 Parse avoidance not supported on Windows.
* EC1197 Bad parse avoidance flag: "..." Valid flags are: '', '0', '1'
* EC1198 Bad optimize deps flag: "..." Valid flags are: '', '0', '1'
* EC1199 Failed to create asset directory: path:"...": ...
* EC1200 makefile:line: This build does not use local agents; ignoring #pragma localagent.
* EC1201 No relevant ContentVersion version found...
* EC1202 ContentVersion has no data to checksum...
* EC1203 No valid path for symbolic link data...
* EC1204 Failed to checksum symbolic link data "[path]"...
* EC1205 Tried to checksum through stale content version...
* EC1206 Failed to get data path for checksumming...
* EC1207 While checksumming, encountered NULL stream for backingStore "<path>"...
* EC1208 Failed to open cached parse result: '<path>': <system-error>
* EC1209 Not a cached parse result: '<path>'
* EC1210 Bad cached parse result: '<path>': ...
* EC1211 Garbage at end of cached parse result: '<path>'
* EC1212 Failed to create cache directory '<dir>': ...
* EC1213 Failed to create temporary slot directory with prefix '<path>': <system-error>
* EC1214 Failed to open slot key: '<path>': <system-error>
* EC1215 Failed to save slot key: '<path>': ...
* EC1216 Failed to create new parse result '<path>': <system-error>
* EC1217 Failed to write new parse result '<path>': <system-error>
* EC1218 Failed to open operations file '<path>': <system-error>
* EC1219 Not an operations file: '<path>'
* EC1220 <path>: unexpected cache version: <actual-version> instead of <expected-version>
* EC1221 <path>: Bad operations file: ...
* EC1222 Failed to load operations from '<path>': ...
* EC1223 Garbage at end of cached operations: '<path>'
* EC1224 Failed to open inputs file: '<path>'
* EC1225 Not an inputs file: '<path>'
* EC1226 <path>: unexpected cache version: <actual-version> instead of <expected-version>
* EC1227 Garbage at end of inputs: '<path>'
* EC1228 Failed to read inputs from '<path>': ...
* EC1229 Failed to create inputs file '<path>': <system-error>
* EC1230 Failed to save inputs to '<path>': ...
* EC1231 Failed to create operations file '<path>': <system-error>
* EC1232 Failed to save operations to '<path>': ...
* EC1233 Failed to rename '<slot>' to '<doom>': <system-error>
* EC1234 Failed to rename '<update>' to '<slot>': <system-error>
* EC1235 ...
* EC1236 Two Names for one path: path:"<path>" oldNameId:<id> newNameId:<id>
* EC1237 Two Names for one path: path:"<path>" oldNameId:<id> newNameId:<id>
* EC1238 Two Names for one path: path:"<path>" oldNameId:<id> newNameId:<id>
* EC1239 Two Contents for one path: path:"<path>" oldContentId:<id> newContentId:<id>
* EC1240 No local agents available. Please restart the ElectricAccelerator Developer Edition Service.
* EC1241 Ant emulation is deprecated and will be removed in a future version of ElectricAcclerator.
* EC1242 Detected invalid type ID while reloading parse data
* EC1243 Failed to get IP addresses of network interfaces on this host
* EC1244 Bad optimize scheduler flag: "..." Valid flags are: '', '0', '1'
* EC1245 Failed to open schedule file "[pathname]" for reading: ...
* EC1246 Failed to get size of schedule file "[pathname]": ...
* EC1247 Error reading header in schedule file "[pathname]": ...
* EC1248 <pathname>:<line>[:<column>]: schedule file syntax error: ...
* EC1249 Job weighted twice by schedule file "[pathname]": ...
* EC1250 Failed to wait for shutdown event:<Event-ID> error:<message>
* EC1251 Failed to create standard (output|error) file '<path>': <system-error>
* EC1252 Failed to save standard (output|error) to '<path>': ...
* EC1253 Failed to open standard (output|error) file '<path>': <system-error>
* EC1254 Failed to load standard (output|error) from '<path>': ...
* EC1255 <path>: directory entry check without pattern: path:<path>
* EC1256 <path>: failed to read current directory entries: path:<path>
* EC1257 <path>: failed to read current subdirectory entries: path:<path>
* EC1258 <path>: failed to get entry attributes: path:<path>
* EC1259 Failed to append to standard (output|error) file '<path>': <system-error>
* EC1260 Failed to read for checksumming: <system-error>
* EC1261 Bad disable CRC flag: "..." Valid flags are: '', '0', '1'
* EC1262 Ignoring schedule file "[pathname]": version mismatch
* EC1263 Ignoring schedule file "[pathname]": incomplete header
* EC1264 Ignoring schedule file "[pathname]": wrong file type
* EC1265 Ignoring schedule file "[pathname]": invalid job count
* EC1266 Ignoring schedule file "[pathname]": error reading job count: <system-error>
* EC1267 Ignoring schedule file "[pathname]": incomplete job count
* EC1268 Ignoring schedule file "[pathname]": error reading jobs table: <system-error>
* EC1269 Ignoring schedule file "[pathname]": incomplete jobs table
* EC1270 Ignoring schedule file "[pathname]": error reading deps table: <system-error>
* EC1271 Ignoring schedule file "[pathname]": byte order mismatch

* EC1272 Failed to open schedule file "[pathname]" for writing: <system-error>
* EC1273 Failed to create schedule file directory "[pathname]": <system-error>


Agent Error Messages

* EC2002 Unknown command code 0x%x (last command was %s).
* EC2003 Session::doCommand received name record whose EfsFileName would not fit in a single page.
* EC2004 Bad root "[root]": UNC paths aren't allowed (root must be in a drive such as C: ) .
* EC2005 Bad root "[root]": must start with a drive name such as C:/.
* EC2006 Bad root "[root]": this would interfere with the Electric Agent's state files stored in "[dir]".
* EC2007 Bad root "[root]": this would interfere with the system root "[dir]".
* EC2008 Bad root "[root]": this would interfere with the temporary directory "[dir]".
* EC2009 Bad root "[root]": there is a CD-ROM occupying this drive letter on the node.
* EC2010 Bad root "[root]": there is a removable disk occupying this drive letter on the node.
* EC2011 pipeline error.
* EC2012 Socket already open.
* EC2013 Couldn't create client socket: [error].
* EC2014 Couldn't find host "[host]": [error].
* EC2015 Couldn't connect to server: [error.
* EC2016 Couldn't set close-on-exec for socket: [error].
* EC2017 No connection open.
* EC2018 No connection open.
* EC2019 Error reading from socket: [error].
* EC2020 I/O error sending to socket: [error].
* EC2021 Error polling for socket to become writable: [error].
* EC2022 Couldn't create server socket: [error].
* EC2023 Couldn't set close-on-exec for server socket: [error].
* EC2024 Couldn't bind server socket to port: [error].
* EC2025 Couldn't query port number from socket: [error].
* EC2026 Couldn't listen on server socket: [error].
* EC2027 Server got error during accept: [error].
* EC2028 Couldn't set close-on-exec for server socket: [error].
* EC2029 Couldn't read disk cache table: improper format.
* EC2030 Couldn't open "[comm file]" for writing: [error].
* EC2031 EfsCommander couldn't set close-on-exec: [error].
* EC2032 EfsCommander couldn't close mHandle: [error].
* EC2033 EfsCommander::flush couldn't write to EFS: [error].
* EC2034 EfsCommander was passed malformed registry key, must be absolute object path.
* EC2035 FileUsageWithData::emitFileData found NULL data locator, unable to send file data.
* EC2036 FileUsageWithData::emitFileData found record with incorrect type, unable to send file data.
* EC2037 pipeline error.
* EC2038 Mount::set couldn't open repository "[repo]": [error].
* EC2039 Mount::set couldn't create directory "[dir]": [error].
* EC2040 Couldn't read mount file: improper format.
* EC2041 Unable to create agent HTTP listener: [error].
* EC2042 Repository unable to create agent file "[file]": [error].
* EC2043 Repository couldn't write agent file "[file]": [error].
* EC2044 Couldn't read repository: [error].
* EC2045 Couldn't write repository: [error].
* EC2046 Session::doCommand received name record before directory attributes.
* EC2047 Session::doCommand received name record before file attributes.
* EC2048 Unable to get size of emake stub command file [file]: [error].
* EC2049 Unable to read contents of emake stub command file [file]: [error].
* EC2050 Session::doCommand received E2A_SET_GOT_ALL_DIRECTORY_ENTRIES command for unknown directory.
* EC2051 E2A_LOAD_FILE_FROM_NODE received file data before attributes.
* EC2052 Error waiting for disk cache data in E2A_LOAD_FILE_FROM_NODE request.
* EC2053 Session::readFileData received file data before attributes.
* EC2054 Session::readFileData couldn't open cache file for writing.
* EC2055 pipeline error.
* EC2056 AgentExec::runCommand() was unable to contact the execserver: [error].
* EC2057 AgentExec::runCommand() was unable to get command results from the execserver: [error].
* EC2058 AgentExecImpl::startServer couldn't fork for execserver: [error].
* EC2059 AgentExecImpl::startServer couldn't ping execserver.
* EC2060 UnixBufferPool::allocateBuffer couldn't find free buffer or WinBufferPool::allocateBuffer couldn't find free buffer.
* EC2061 UnixBufferPool::flush couldn't write to {buffer [x]:[y]}+[l]: [error].
* EC2062 Error mounting filesystem at "[mount point]": [error].
* EC2063 *** bad root "[root]".
* EC2064 Unable to attach pipe to file descriptor.
* EC2065 Error reading from pipe: [error].
* EC2066 Unable to create pipe.
* EC2067 Couldn't read cygwinMounts table: improper format.
* EC2068 GetVolumePathNameW([path]): [error].
* EC2069 [drive]:  cannot filter a volume mount point..
* EC2070 QueryDosDeviceW([mountpoint]):  [error].
* EC2071 Can't handle UNC paths.
* EC2072 Unhandled device mapping:  [device].
* EC2073 Couldn't create path [drive] to hold root [mountpoint]:  [err].
* EC2074 Can't create DOS drive for root "[mountpoint]": drive is already in use.
* EC2075 Error preparing mount point: [error].
* EC2076 setRootPaths([root], [mountpoint], [kernelpath], [volumedevice]): [error].
* EC2077 Registry::setRoots was passed an illegal root handle: [handle].
* EC2078 Registry::setRoots couldn't create shadow registry key: [error].
* EC2079 Registry::remapKey unable to find root for [key] "[name]".
* EC2080 Registry::setKey unable to create key "[key]": [error].
* EC2081 Registry::setKey unable to set registry value "[name]": [error].
* EC2082 Agent has shut down or switched to a different CM.
* EC2083 session abort.
* EC2084 session abort wait.
* EC2085 session abort.
* EC2086 session abort wait.
* EC2087 any message.
* EC2088 ios_base::failure message talking to agent.
* EC2089 error from runCommand.
* EC2090 error from EFS.
* EC2091 Mount point "[mount point]" was not created by Mount::set.
* EC2092 E2A command sent to A2A server.
* EC2093 Clock skew between emake and agent is %d ms.
* EC2094 Problem resolving cygwin mounts.
* EC2095 Error cleaning up cygwin mounts.
* EC2096 Cygwin mount conflict.
* EC2097 Bad root "...": there is an unformatted disk occupying this drive letter on the node.
* EC2098 Couldn't read symlink cache table: improper format.
* EC2099 Couldn't create symlink root.
* EC2100 Couldn't set non-blocking mode on socket.
* EC2101 Requested nameId is already in use as contentId.
* EC2102 Requested contentId is already in use as a nameId.
* EC2103 Requested directoryId is a nameId.
* EC2104 Requested directoryId is a file contentId.
* EC2105 Requested contentId is a directoryId.
* EC2106 No visible content version for contentId.
* EC2107 Bad root "path": unable to stat "component/of/path".
* EC2108 Emake is 64-bit but agent is 32-bit.
* EC2109 Agent can't access path due to insufficient permissions.
* EC2110 Agent expected directory but found file.
* EC2111 Error creating sandbox mountpoint "path".
* EC2112 Session::readFileData found incomplete file in diskcache.
* EC2113 Error in waitComplete in CacheWritePipelineStage::finalize.
* EC2114 Error in Session::doSetGotAllSubkeys.
* EC2115 Error in Session::doSetGotAllValues.
* EC2116 Don't have valid RegKeyInfo entry in Session::mRegKeyMap.
* EC2117 SessionEfsService::needKey didn't get key information from emake.
* EC2118 Registry::insertValues couldn't open registry key.
* EC2119 Session::doPutAllKeyVersions got invalid parent key id NNN.
* EC2120 Requested keyId is in use.
* EC2121 Requested parent keyId is in use.
* EC2122 Requested validId is in use.
* EC2123 Session::doPutAllValueVersions received valueId before keyId.
* EC2124 Agent licensing problem: ...
* EC2128 Security Error: authentication rejected
EC2129 Security Error: authentication required
* EC2130 Security Error: authentication not offered
EC2131 Security Error: already authenticated
EC2132 Security Warning: unavailable user XXX; instead setting user AAA and groups BBB,CCC
EC2133 Security Warning: unavailable primary group YYY; instead setting user AAA and groups BBB,CCC
EC2134 Security Warning: unavailable supplementary groups YYY,ZZZ; instead setting user AAA and groups BBB,CCC
EC2135 Empty group list in E2A_SET_USER
EC2136 Unable to create file: "[pathname]": [system error]
EC2137 Unable to delete temporary file: "[pathname]": [system error]
* EC2138 Checksum mismatch

CM Error Messages

* EC3001 Failed to initialize the curl handle.
* EC3002 Request failed.
* EC3003 Response does not have <ECloud> tag.
* EC3004 XML parser threw exception: [err] (XML is '[xml]').
* EC3005 doSendHTTP: You must call connect() first.
* EC3006 Couldn't resolve CM host.
* EC3007 Invalid password for user 'emake'.
* EC3008 HTTP code [string].
* EC3009 Unable to connect to CM.
* EC3010 Sending HTTP command failed with curl error([code]): [error].
* EC3011 doSendHTTP: You must call connect() first.
* EC3012 Unable to open file "[file]".
* EC3013 CM refused notifyBuild request.
* EC3014 Error code is not a valid int.
* EC3015 Potentially unsafe mount directory.
* EC3016 Unrecognized emake-debug option "[option]".
* EC3101 BuildStopped: Build X was stopped from the cluster manager.
* EC3102 BuildTimedOut: Build X was stopped because it timed out.

Have more questions? Submit a request

Comments

Powered by Zendesk